{"text_format":"1","workbook":"xlsx","n_sheets":5,"sheets":["2025 NOW-CALCULATOR - UNITS","SUMMARY - UNITS (2025)","REBATE MATRIX (NOW)","2025 NOW_EOP_LL","Sheet4"],"not_rendered":{"charts":0,"images":2,"macros":1,"external_links":0,"defined_names":19,"comments":2,"pivot_tables":1},"unopened":[],"bounds":{"document_bytes":16777216,"sheet_cells":100000,"rows_first":2000,"rows_last":500,"rows_between":2000,"halvings":0,"cell_chars":16384,"cell_head_chars":4096},"cells_cut":0,"cells_raw":0,"read":"whole","date_system":"1900"}

{"sheet":"2025 NOW-CALCULATOR - UNITS","index":0,"n_rows":54,"n_cols":28,"rows_kept":54,"cut":false,"hidden":false,"merged":[[6,22,7,23],[8,22,8,23],[6,17,7,17],[6,18,7,19],[8,18,8,19],[6,20,7,21],[8,20,8,21],[45,3,45,5],[46,3,46,5],[46,11,49,23],[11,16,13,16],[44,3,44,5],[11,23,13,23],[50,3,50,5],[53,3,53,7],[51,3,51,5],[51,6,51,7],[47,3,47,5],[48,3,48,5],[49,3,49,5],[0,4,0,11],[11,15,13,15],[11,13,13,13],[11,3,13,3],[11,4,13,4],[11,5,13,5],[11,7,13,7],[11,8,13,8],[11,9,13,9],[3,3,3,4],[11,0,13,0],[43,3,43,5],[11,12,13,12],[11,14,13,14],[11,1,13,1],[11,10,13,10],[11,11,13,11],[38,3,38,7],[41,3,41,5],[42,3,42,5],[38,11,43,23],[11,22,13,22],[11,6,13,6],[11,17,13,17],[11,18,13,18],[41,6,41,7],[40,3,40,5],[40,6,40,7],[11,20,13,20],[11,21,13,21],[11,19,13,19]]}
[null,null,null,null,"         CALIFORNIA 2025 NOW SOLUTIONS CALCULATOR                  "]
[]
[null,null,null,null,null,null,null,null,null,null,null,null,null,null,null,null,null,null,"Additional Rebates & Bonus Unlocks:"]
[null,null,null,"NAME YOUR DRAFT ORDER HERE:",null,null,null,null,null,null,null,null,null,null,null,null,null,"Spend Requirement:","$5k+","$10k+","$20k+","$50k+","$100k+","$150k+"]
[null,null,null,"Description: ",null,null,null,null,null,null,null,null,null,null,null,null,null,"Tier Rebate:",0.02,0.02,0.03,0.04,0.05,0.06]
[null,null,null,"Dist/DSR: ",null,null,null,null,null,null,null,null,null,null,null,null,null,null,{"$f":"AND($L$36>=5000,$L$36<10000)","v":false},{"$f":"AND($L$36>=10000,$L$36<20000)","v":false},{"$f":"AND($L$36>=20000,$L$36<50000)","v":false},{"$f":"AND($L$36>=50000,$L$36<100000)","v":false},{"$f":"AND($L$36>=100000,$L$36<150000)","v":false},{"$f":"$L$36>=150000","v":false}]
[null,null,null,"MER#: ",null,null,null,null,null,null,null,null,null,null,null,null,null,"Product:","Stressgard &Chipco Sig.\n(>$10k)",null,"Serata\n(8 unit min.)",null,"Volume Buy\n(5 or more products)"]
[null,null,null,"Last Updated: "]
[null,null,null,"Created For: ",null,null,null,null,null,null,null,null,null,null,null,null,null,null,{"$f":"IF(S11=0,\"n/a\",S11)","v":"n/a"},null,{"$f":"IF(U11=0,\"n/a\",U11)","v":"n/a"},null,{"$f":"IF(W11=0,\"n/a\",W11)","v":"n/a"}]
[null,null,null,null,null,null,null,null,null,null,null,null,null,null,null,null,null,null,"Spend < $50k = 1.0%;   Spend > $50k =  2.0%"]
{"$rows_left_out":45}
{"sheet":"SUMMARY - UNITS (2025)","index":1,"n_rows":61,"n_cols":9,"rows_kept":61,"cut":false,"hidden":false,"merged":[[40,2,40,5],[46,2,46,5],[34,2,35,8],[8,7,10,7],[8,8,10,8],[39,2,39,4],[37,6,37,7],[38,2,38,5],[37,2,37,5],[36,2,36,5],[36,6,36,7],[1,2,1,6],[2,3,2,6],[3,3,3,6],[4,3,4,6],[5,3,5,6],[6,3,6,6],[8,2,10,2],[8,3,10,3],[8,4,10,4],[8,6,10,6],[8,5,10,5],[51,2,59,8],[60,2,64,8],[41,2,41,5],[47,2,47,5],[45,2,45,5],[44,2,44,5],[43,2,43,5],[42,2,42,5],[47,6,47,7],[49,2,49,7]]}
[]
[null,null,{"$f":"'2025 NOW-CALCULATOR - UNITS'!D4","v":"NAME YOUR DRAFT ORDER HERE:"}]
[null,null,"Description: ",{"$f":"IF('2025 NOW-CALCULATOR - UNITS'!E5=\"\",\"\",'2025 NOW-CALCULATOR - UNITS'!E5)","v":""}]
[null,null,"Distributor/DSR: ",{"$f":"IF('2025 NOW-CALCULATOR - UNITS'!E6=\"\",\"\",'2025 NOW-CALCULATOR - UNITS'!E6)","v":""}]
[null,null,"MER#: ",{"$f":"IF('2025 NOW-CALCULATOR - UNITS'!E7=\"\",\"\",'2025 NOW-CALCULATOR - UNITS'!E7)","v":""}]
[null,null,"Last Updated: ",{"$f":"IF('2025 NOW-CALCULATOR - UNITS'!E8=\"\",\"\",'2025 NOW-CALCULATOR - UNITS'!E8)","v":""}]
[null,null,"Created For: ",{"$f":"IF('2025 NOW-CALCULATOR - UNITS'!E9=\"\",\"\",'2025 NOW-CALCULATOR - UNITS'!E9)","v":""}]
[null,null,"Page 1 of 1"]
[null,null,"PRODUCT NAME","UNIT SIZE","# UNITS","ORIGINAL PRICE/UNIT","NOW \nPRICE/UNIT","SUBTOTAL","NET PRICE/UNIT\n(after rebate)"]
[]
{"$rows_left_out":52}
{"sheet":"REBATE MATRIX (NOW)","index":2,"n_rows":47,"n_cols":18,"rows_kept":47,"cut":false,"hidden":true,"merged":[]}
[null,null,null,null,null,null,null,null,null,null,null,null,null,null,null,{"$f":"COUNTIF(Rebate_Lookup[Volume Buy Counter],TRUE)","v":0}]
[null,"SKU CODE","Agency/TT","Description","Size","Instances","MOQ_1","MOQ_2","MOQ_3","REB_MOQ_1","REB_MOQ_2","REB_MOQ_3","Order Form Quantity","Qualified Rebate Tier","Column1","Volume Buy Counter"]
[null,"D00000665",{"$f":"INDEX(PRICING[Agency/TT],MATCH(Rebate_Lookup[[#This Row],[SKU CODE]],PRICING[SKU],0))","v":{"$error":"#N/A"}},{"$f":"INDEX(PRICING[Product],MATCH(B3,PRICING[SKU],0))","v":{"$error":"#N/A"}},{"$f":"INDEX(PRICING[Size],MATCH(Rebate_Lookup[[#This Row],[SKU CODE]],PRICING[SKU],0))","v":{"$error":"#N/A"}},{"$f":"COUNTIFS(PRICING[Program],\"NOW\",PRICING[SKU],B3)","v":0},175,null,null,{"$f":"SUMIFS(PRICING[Rebate $],PRICING[Program],\"NOW\",PRICING[SKU],Rebate_Lookup[[#This Row],[SKU CODE]],PRICING[Set],1)","v":0},{"$f":"SUMIFS(PRICING[Rebate $],PRICING[Program],\"NOW\",PRICING[SKU],Rebate_Lookup[[#This Row],[SKU CODE]],PRICING[Set],2)","v":0},{"$f":"SUMIFS(PRICING[Rebate $],PRICING[Program],\"NOW\",PRICING[SKU],Rebate_Lookup[[#This Row],[SKU CODE]],PRICING[Set],3)","v":0},{"$f":"INDEX('2025 NOW-CALCULATOR - UNITS'!H:H,MATCH(Rebate_Lookup[[#This Row],[SKU CODE]],'2025 NOW-CALCULATOR - UNITS'!A:A,0))","v":{"$error":"#N/A"}},{"$f":"IF(Rebate_Lookup[[#This Row],[Instances]]=1,1,\nIF(AND(Rebate_Lookup[[#This Row],[Instances]]=2,Rebate_Lookup[[#This Row],[Order Form Quantity]]<Rebate_Lookup[[#This Row],[MOQ_2]]),1,IF(AND(Rebate_Lookup[[#This Row],[Instances]]=2,Rebate_Lookup[[#This Row],[Order Form Quantity]]>=Rebate_Lookup[[#This Row],[MOQ_2]]),2,\nIF(AND(Rebate_Lookup[[#This Row],[Instances]]=3,Rebate_Lookup[[#This Row],[Order Form Quantity]]<Rebate_Lookup[[#This Row],[MOQ_2]]),1,IF(AND(Rebate_Lookup[[#This Row],[Instances]]=3,Rebate_Lookup[[#This Row],[MOQ_2]]<=Rebate_Lookup[[#This Row],[Order Form Quantity]],Rebate_Lookup[[#This Row],[Order Form Quantity]]<Rebate_Lookup[[#This Row],[MOQ_3]]),2,IF(AND(Rebate_Lookup[[#This Row],[Instances]]=3,Rebate_Lookup[[#This Row],[Order Form Quantity]]>=Rebate_Lookup[[#This Row],[MOQ_3]]),3))))))","v":{"$error":"#N/A"}},{"$f":"COUNTIF('2025 NOW-CALCULATOR - UNITS'!A:A,Rebate_Lookup[[#This Row],[SKU CODE]])","v":0},{"$f":"IFERROR(Rebate_Lookup[[#This Row],[Order Form Quantity]]>=Rebate_Lookup[[#This Row],[MOQ_2]],0)","v":0},null,{"$f":"COUNTIF('2025 NOW-CALCULATOR - UNITS'!A:A,Rebate_Lookup[[#This Row],[SKU CODE]])","v":0}]
[null,"D00000666",{"$f":"INDEX(PRICING[Agency/TT],MATCH(Rebate_Lookup[[#This Row],[SKU CODE]],PRICING[SKU],0))","v":{"$error":"#N/A"}},{"$f":"INDEX(PRICING[Product],MATCH(B4,PRICING[SKU],0))","v":{"$error":"#N/A"}},{"$f":"INDEX(PRICING[Size],MATCH(Rebate_Lookup[[#This Row],[SKU CODE]],PRICING[SKU],0))","v":{"$error":"#N/A"}},{"$f":"COUNTIFS(PRICING[Program],\"NOW\",PRICING[SKU],B4)","v":0},175,null,null,{"$f":"SUMIFS(PRICING[Rebate $],PRICING[Program],\"NOW\",PRICING[SKU],Rebate_Lookup[[#This Row],[SKU CODE]],PRICING[Set],1)","v":0},{"$f":"SUMIFS(PRICING[Rebate $],PRICING[Program],\"NOW\",PRICING[SKU],Rebate_Lookup[[#This Row],[SKU CODE]],PRICING[Set],2)","v":0},{"$f":"SUMIFS(PRICING[Rebate $],PRICING[Program],\"NOW\",PRICING[SKU],Rebate_Lookup[[#This Row],[SKU CODE]],PRICING[Set],3)","v":0},{"$f":"INDEX('2025 NOW-CALCULATOR - UNITS'!H:H,MATCH(Rebate_Lookup[[#This Row],[SKU CODE]],'2025 NOW-CALCULATOR - UNITS'!A:A,0))","v":{"$error":"#N/A"}},{"$f":"IF(Rebate_Lookup[[#This Row],[Instances]]=1,1,\nIF(AND(Rebate_Lookup[[#This Row],[Instances]]=2,Rebate_Lookup[[#This Row],[Order Form Quantity]]<Rebate_Lookup[[#This Row],[MOQ_2]]),1,IF(AND(Rebate_Lookup[[#This Row],[Instances]]=2,Rebate_Lookup[[#This Row],[Order Form Quantity]]>=Rebate_Lookup[[#This Row],[MOQ_2]]),2,\nIF(AND(Rebate_Lookup[[#This Row],[Instances]]=3,Rebate_Lookup[[#This Row],[Order Form Quantity]]<Rebate_Lookup[[#This Row],[MOQ_2]]),1,IF(AND(Rebate_Lookup[[#This Row],[Instances]]=3,Rebate_Lookup[[#This Row],[MOQ_2]]<=Rebate_Lookup[[#This Row],[Order Form Quantity]],Rebate_Lookup[[#This Row],[Order Form Quantity]]<Rebate_Lookup[[#This Row],[MOQ_3]]),2,IF(AND(Rebate_Lookup[[#This Row],[Instances]]=3,Rebate_Lookup[[#This Row],[Order Form Quantity]]>=Rebate_Lookup[[#This Row],[MOQ_3]]),3))))))","v":{"$error":"#N/A"}},{"$f":"COUNTIF('2025 NOW-CALCULATOR - UNITS'!A:A,Rebate_Lookup[[#This Row],[SKU CODE]])","v":0},{"$f":"IFERROR(Rebate_Lookup[[#This Row],[Order Form Quantity]]>=Rebate_Lookup[[#This Row],[MOQ_2]],0)","v":0},null,{"$f":"COUNTIF('2025 NOW-CALCULATOR - UNITS'!A:A,Rebate_Lookup[[#This Row],[SKU CODE]])","v":0}]
[null,87300722,{"$f":"INDEX(PRICING[Agency/TT],MATCH(Rebate_Lookup[[#This Row],[SKU CODE]],PRICING[SKU],0))","v":{"$error":"#N/A"}},{"$f":"INDEX(PRICING[Product],MATCH(B5,PRICING[SKU],0))","v":{"$error":"#N/A"}},{"$f":"INDEX(PRICING[Size],MATCH(Rebate_Lookup[[#This Row],[SKU CODE]],PRICING[SKU],0))","v":{"$error":"#N/A"}},{"$f":"COUNTIFS(PRICING[Program],\"NOW\",PRICING[SKU],B5)","v":0},0,null,null,{"$f":"SUMIFS(PRICING[Rebate $],PRICING[Program],\"NOW\",PRICING[SKU],Rebate_Lookup[[#This Row],[SKU CODE]],PRICING[Set],1)","v":0},{"$f":"SUMIFS(PRICING[Rebate $],PRICING[Program],\"NOW\",PRICING[SKU],Rebate_Lookup[[#This Row],[SKU CODE]],PRICING[Set],2)","v":0},{"$f":"SUMIFS(PRICING[Rebate $],PRICING[Program],\"NOW\",PRICING[SKU],Rebate_Lookup[[#This Row],[SKU CODE]],PRICING[Set],3)","v":0},{"$f":"INDEX('2025 NOW-CALCULATOR - UNITS'!H:H,MATCH(Rebate_Lookup[[#This Row],[SKU CODE]],'2025 NOW-CALCULATOR - UNITS'!A:A,0))","v":{"$error":"#N/A"}},{"$f":"IF(Rebate_Lookup[[#This Row],[Instances]]=1,1,\nIF(AND(Rebate_Lookup[[#This Row],[Instances]]=2,Rebate_Lookup[[#This Row],[Order Form Quantity]]<Rebate_Lookup[[#This Row],[MOQ_2]]),1,IF(AND(Rebate_Lookup[[#This Row],[Instances]]=2,Rebate_Lookup[[#This Row],[Order Form Quantity]]>=Rebate_Lookup[[#This Row],[MOQ_2]]),2,\nIF(AND(Rebate_Lookup[[#This Row],[Instances]]=3,Rebate_Lookup[[#This Row],[Order Form Quantity]]<Rebate_Lookup[[#This Row],[MOQ_2]]),1,IF(AND(Rebate_Lookup[[#This Row],[Instances]]=3,Rebate_Lookup[[#This Row],[MOQ_2]]<=Rebate_Lookup[[#This Row],[Order Form Quantity]],Rebate_Lookup[[#This Row],[Order Form Quantity]]<Rebate_Lookup[[#This Row],[MOQ_3]]),2,IF(AND(Rebate_Lookup[[#This Row],[Instances]]=3,Rebate_Lookup[[#This Row],[Order Form Quantity]]>=Rebate_Lookup[[#This Row],[MOQ_3]]),3))))))","v":{"$error":"#N/A"}},{"$f":"COUNTIF('2025 NOW-CALCULATOR - UNITS'!A:A,Rebate_Lookup[[#This Row],[SKU CODE]])","v":0},{"$f":"IFERROR(Rebate_Lookup[[#This Row],[Order Form Quantity]]>=Rebate_Lookup[[#This Row],[MOQ_2]],0)","v":0},null,{"$f":"COUNTIF('2025 NOW-CALCULATOR - UNITS'!A:A,Rebate_Lookup[[#This Row],[SKU CODE]])","v":0}]
[null,"D00000898",{"$f":"INDEX(PRICING[Agency/TT],MATCH(Rebate_Lookup[[#This Row],[SKU CODE]],PRICING[SKU],0))","v":{"$error":"#N/A"}},{"$f":"INDEX(PRICING[Product],MATCH(B6,PRICING[SKU],0))","v":{"$error":"#N/A"}},{"$f":"INDEX(PRICING[Size],MATCH(Rebate_Lookup[[#This Row],[SKU CODE]],PRICING[SKU],0))","v":{"$error":"#N/A"}},{"$f":"COUNTIFS(PRICING[Program],\"NOW\",PRICING[SKU],B6)","v":0},0,null,null,{"$f":"SUMIFS(PRICING[Rebate $],PRICING[Program],\"NOW\",PRICING[SKU],Rebate_Lookup[[#This Row],[SKU CODE]],PRICING[Set],1)","v":0},{"$f":"SUMIFS(PRICING[Rebate $],PRICING[Program],\"NOW\",PRICING[SKU],Rebate_Lookup[[#This Row],[SKU CODE]],PRICING[Set],2)","v":0},{"$f":"SUMIFS(PRICING[Rebate $],PRICING[Program],\"NOW\",PRICING[SKU],Rebate_Lookup[[#This Row],[SKU CODE]],PRICING[Set],3)","v":0},{"$f":"INDEX('2025 NOW-CALCULATOR - UNITS'!H:H,MATCH(Rebate_Lookup[[#This Row],[SKU CODE]],'2025 NOW-CALCULATOR - UNITS'!A:A,0))","v":{"$error":"#N/A"}},{"$f":"IF(Rebate_Lookup[[#This Row],[Instances]]=1,1,\nIF(AND(Rebate_Lookup[[#This Row],[Instances]]=2,Rebate_Lookup[[#This Row],[Order Form Quantity]]<Rebate_Lookup[[#This Row],[MOQ_2]]),1,IF(AND(Rebate_Lookup[[#This Row],[Instances]]=2,Rebate_Lookup[[#This Row],[Order Form Quantity]]>=Rebate_Lookup[[#This Row],[MOQ_2]]),2,\nIF(AND(Rebate_Lookup[[#This Row],[Instances]]=3,Rebate_Lookup[[#This Row],[Order Form Quantity]]<Rebate_Lookup[[#This Row],[MOQ_2]]),1,IF(AND(Rebate_Lookup[[#This Row],[Instances]]=3,Rebate_Lookup[[#This Row],[MOQ_2]]<=Rebate_Lookup[[#This Row],[Order Form Quantity]],Rebate_Lookup[[#This Row],[Order Form Quantity]]<Rebate_Lookup[[#This Row],[MOQ_3]]),2,IF(AND(Rebate_Lookup[[#This Row],[Instances]]=3,Rebate_Lookup[[#This Row],[Order Form Quantity]]>=Rebate_Lookup[[#This Row],[MOQ_3]]),3))))))","v":{"$error":"#N/A"}},{"$f":"COUNTIF('2025 NOW-CALCULATOR - UNITS'!A:A,Rebate_Lookup[[#This Row],[SKU CODE]])","v":0},{"$f":"IFERROR(Rebate_Lookup[[#This Row],[Order Form Quantity]]>=Rebate_Lookup[[#This Row],[MOQ_2]],0)","v":0},null,{"$f":"COUNTIF('2025 NOW-CALCULATOR - UNITS'!A:A,Rebate_Lookup[[#This Row],[SKU CODE]])","v":0}]
[null,"D00000907",{"$f":"INDEX(PRICING[Agency/TT],MATCH(Rebate_Lookup[[#This Row],[SKU CODE]],PRICING[SKU],0))","v":"A"},{"$f":"INDEX(PRICING[Product],MATCH(B7,PRICING[SKU],0))","v":"Banol®"},{"$f":"INDEX(PRICING[Size],MATCH(Rebate_Lookup[[#This Row],[SKU CODE]],PRICING[SKU],0))","v":"2.5 gal "},{"$f":"COUNTIFS(PRICING[Program],\"NOW\",PRICING[SKU],B7)","v":2},0,2,null,{"$f":"SUMIFS(PRICING[Rebate $],PRICING[Program],\"NOW\",PRICING[SKU],Rebate_Lookup[[#This Row],[SKU CODE]],PRICING[Set],1)","v":0},{"$f":"SUMIFS(PRICING[Rebate $],PRICING[Program],\"NOW\",PRICING[SKU],Rebate_Lookup[[#This Row],[SKU CODE]],PRICING[Set],2)","v":90},{"$f":"SUMIFS(PRICING[Rebate $],PRICING[Program],\"NOW\",PRICING[SKU],Rebate_Lookup[[#This Row],[SKU CODE]],PRICING[Set],3)","v":0},{"$f":"INDEX('2025 NOW-CALCULATOR - UNITS'!H:H,MATCH(Rebate_Lookup[[#This Row],[SKU CODE]],'2025 NOW-CALCULATOR - UNITS'!A:A,0))","v":0},{"$f":"IF(Rebate_Lookup[[#This Row],[Instances]]=1,1,\nIF(AND(Rebate_Lookup[[#This Row],[Instances]]=2,Rebate_Lookup[[#This Row],[Order Form Quantity]]<Rebate_Lookup[[#This Row],[MOQ_2]]),1,IF(AND(Rebate_Lookup[[#This Row],[Instances]]=2,Rebate_Lookup[[#This Row],[Order Form Quantity]]>=Rebate_Lookup[[#This Row],[MOQ_2]]),2,\nIF(AND(Rebate_Lookup[[#This Row],[Instances]]=3,Rebate_Lookup[[#This Row],[Order Form Quantity]]<Rebate_Lookup[[#This Row],[MOQ_2]]),1,IF(AND(Rebate_Lookup[[#This Row],[Instances]]=3,Rebate_Lookup[[#This Row],[MOQ_2]]<=Rebate_Lookup[[#This Row],[Order Form Quantity]],Rebate_Lookup[[#This Row],[Order Form Quantity]]<Rebate_Lookup[[#This Row],[MOQ_3]]),2,IF(AND(Rebate_Lookup[[#This Row],[Instances]]=3,Rebate_Lookup[[#This Row],[Order Form Quantity]]>=Rebate_Lookup[[#This Row],[MOQ_3]]),3))))))","v":1},{"$f":"COUNTIF('2025 NOW-CALCULATOR - UNITS'!A:A,Rebate_Lookup[[#This Row],[SKU CODE]])","v":1},{"$f":"IFERROR(Rebate_Lookup[[#This Row],[Order Form Quantity]]>=Rebate_Lookup[[#This Row],[MOQ_2]],0)","v":false},null,{"$f":"COUNTIF('2025 NOW-CALCULATOR - UNITS'!A:A,Rebate_Lookup[[#This Row],[SKU CODE]])","v":1}]
[null,11008351,{"$f":"INDEX(PRICING[Agency/TT],MATCH(Rebate_Lookup[[#This Row],[SKU CODE]],PRICING[SKU],0))","v":{"$error":"#N/A"}},{"$f":"INDEX(PRICING[Product],MATCH(B8,PRICING[SKU],0))","v":{"$error":"#N/A"}},{"$f":"INDEX(PRICING[Size],MATCH(Rebate_Lookup[[#This Row],[SKU CODE]],PRICING[SKU],0))","v":{"$error":"#N/A"}},{"$f":"COUNTIFS(PRICING[Program],\"NOW\",PRICING[SKU],B8)","v":0},0,null,null,{"$f":"SUMIFS(PRICING[Rebate $],PRICING[Program],\"NOW\",PRICING[SKU],Rebate_Lookup[[#This Row],[SKU CODE]],PRICING[Set],1)","v":0},{"$f":"SUMIFS(PRICING[Rebate $],PRICING[Program],\"NOW\",PRICING[SKU],Rebate_Lookup[[#This Row],[SKU CODE]],PRICING[Set],2)","v":0},{"$f":"SUMIFS(PRICING[Rebate $],PRICING[Program],\"NOW\",PRICING[SKU],Rebate_Lookup[[#This Row],[SKU CODE]],PRICING[Set],3)","v":0},{"$f":"INDEX('2025 NOW-CALCULATOR - UNITS'!H:H,MATCH(Rebate_Lookup[[#This Row],[SKU CODE]],'2025 NOW-CALCULATOR - UNITS'!A:A,0))","v":{"$error":"#N/A"}},{"$f":"IF(Rebate_Lookup[[#This Row],[Instances]]=1,1,\nIF(AND(Rebate_Lookup[[#This Row],[Instances]]=2,Rebate_Lookup[[#This Row],[Order Form Quantity]]<Rebate_Lookup[[#This Row],[MOQ_2]]),1,IF(AND(Rebate_Lookup[[#This Row],[Instances]]=2,Rebate_Lookup[[#This Row],[Order Form Quantity]]>=Rebate_Lookup[[#This Row],[MOQ_2]]),2,\nIF(AND(Rebate_Lookup[[#This Row],[Instances]]=3,Rebate_Lookup[[#This Row],[Order Form Quantity]]<Rebate_Lookup[[#This Row],[MOQ_2]]),1,IF(AND(Rebate_Lookup[[#This Row],[Instances]]=3,Rebate_Lookup[[#This Row],[MOQ_2]]<=Rebate_Lookup[[#This Row],[Order Form Quantity]],Rebate_Lookup[[#This Row],[Order Form Quantity]]<Rebate_Lookup[[#This Row],[MOQ_3]]),2,IF(AND(Rebate_Lookup[[#This Row],[Instances]]=3,Rebate_Lookup[[#This Row],[Order Form Quantity]]>=Rebate_Lookup[[#This Row],[MOQ_3]]),3))))))","v":{"$error":"#N/A"}},{"$f":"COUNTIF('2025 NOW-CALCULATOR - UNITS'!A:A,Rebate_Lookup[[#This Row],[SKU CODE]])","v":0},{"$f":"IFERROR(Rebate_Lookup[[#This Row],[Order Form Quantity]]>=Rebate_Lookup[[#This Row],[MOQ_2]],0)","v":0},null,{"$f":"COUNTIF('2025 NOW-CALCULATOR - UNITS'!A:A,Rebate_Lookup[[#This Row],[SKU CODE]])","v":0}]
[null,"D00000623",{"$f":"INDEX(PRICING[Agency/TT],MATCH(Rebate_Lookup[[#This Row],[SKU CODE]],PRICING[SKU],0))","v":"A"},{"$f":"INDEX(PRICING[Product],MATCH(B9,PRICING[SKU],0))","v":"Castlon™"},{"$f":"INDEX(PRICING[Size],MATCH(Rebate_Lookup[[#This Row],[SKU CODE]],PRICING[SKU],0))","v":"1 gal"},{"$f":"COUNTIFS(PRICING[Program],\"NOW\",PRICING[SKU],B9)","v":3},0,5,10,{"$f":"SUMIFS(PRICING[Rebate $],PRICING[Program],\"NOW\",PRICING[SKU],Rebate_Lookup[[#This Row],[SKU CODE]],PRICING[Set],1)","v":0},{"$f":"SUMIFS(PRICING[Rebate $],PRICING[Program],\"NOW\",PRICING[SKU],Rebate_Lookup[[#This Row],[SKU CODE]],PRICING[Set],2)","v":525},{"$f":"SUMIFS(PRICING[Rebate $],PRICING[Program],\"NOW\",PRICING[SKU],Rebate_Lookup[[#This Row],[SKU CODE]],PRICING[Set],3)","v":585},{"$f":"INDEX('2025 NOW-CALCULATOR - UNITS'!H:H,MATCH(Rebate_Lookup[[#This Row],[SKU CODE]],'2025 NOW-CALCULATOR - UNITS'!A:A,0))","v":0},{"$f":"IF(Rebate_Lookup[[#This Row],[Instances]]=1,1,\nIF(AND(Rebate_Lookup[[#This Row],[Instances]]=2,Rebate_Lookup[[#This Row],[Order Form Quantity]]<Rebate_Lookup[[#This Row],[MOQ_2]]),1,IF(AND(Rebate_Lookup[[#This Row],[Instances]]=2,Rebate_Lookup[[#This Row],[Order Form Quantity]]>=Rebate_Lookup[[#This Row],[MOQ_2]]),2,\nIF(AND(Rebate_Lookup[[#This Row],[Instances]]=3,Rebate_Lookup[[#This Row],[Order Form Quantity]]<Rebate_Lookup[[#This Row],[MOQ_2]]),1,IF(AND(Rebate_Lookup[[#This Row],[Instances]]=3,Rebate_Lookup[[#This Row],[MOQ_2]]<=Rebate_Lookup[[#This Row],[Order Form Quantity]],Rebate_Lookup[[#This Row],[Order Form Quantity]]<Rebate_Lookup[[#This Row],[MOQ_3]]),2,IF(AND(Rebate_Lookup[[#This Row],[Instances]]=3,Rebate_Lookup[[#This Row],[Order Form Quantity]]>=Rebate_Lookup[[#This Row],[MOQ_3]]),3))))))","v":1},{"$f":"COUNTIF('2025 NOW-CALCULATOR - UNITS'!A:A,Rebate_Lookup[[#This Row],[SKU CODE]])","v":1},{"$f":"IFERROR(Rebate_Lookup[[#This Row],[Order Form Quantity]]>=Rebate_Lookup[[#This Row],[MOQ_2]],0)","v":false},null,{"$f":"COUNTIF('2025 NOW-CALCULATOR - UNITS'!A:A,Rebate_Lookup[[#This Row],[SKU CODE]])","v":1}]
[null,"D00000624",{"$f":"INDEX(PRICING[Agency/TT],MATCH(Rebate_Lookup[[#This Row],[SKU CODE]],PRICING[SKU],0))","v":{"$error":"#N/A"}},{"$f":"INDEX(PRICING[Product],MATCH(B10,PRICING[SKU],0))","v":{"$error":"#N/A"}},{"$f":"INDEX(PRICING[Size],MATCH(Rebate_Lookup[[#This Row],[SKU CODE]],PRICING[SKU],0))","v":{"$error":"#N/A"}},3,0,4,8,{"$f":"SUMIFS(PRICING[Rebate $],PRICING[SKU],Rebate_Lookup[[#This Row],[SKU CODE]],PRICING[Set],1)","v":0},{"$f":"SUMIFS(PRICING[Rebate $],PRICING[SKU],Rebate_Lookup[[#This Row],[SKU CODE]],PRICING[Set],2)","v":0},{"$f":"SUMIFS(PRICING[Rebate $],PRICING[SKU],Rebate_Lookup[[#This Row],[SKU CODE]],PRICING[Set],3)","v":0},{"$f":"INDEX('2025 NOW-CALCULATOR - UNITS'!H:H,MATCH(Rebate_Lookup[[#This Row],[SKU CODE]],'2025 NOW-CALCULATOR - UNITS'!A:A,0))","v":{"$error":"#N/A"}},{"$f":"IF(Rebate_Lookup[[#This Row],[Instances]]=1,1,\nIF(AND(Rebate_Lookup[[#This Row],[Instances]]=2,Rebate_Lookup[[#This Row],[Order Form Quantity]]<Rebate_Lookup[[#This Row],[MOQ_2]]),1,IF(AND(Rebate_Lookup[[#This Row],[Instances]]=2,Rebate_Lookup[[#This Row],[Order Form Quantity]]>=Rebate_Lookup[[#This Row],[MOQ_2]]),2,\nIF(AND(Rebate_Lookup[[#This Row],[Instances]]=3,Rebate_Lookup[[#This Row],[Order Form Quantity]]<Rebate_Lookup[[#This Row],[MOQ_2]]),1,IF(AND(Rebate_Lookup[[#This Row],[Instances]]=3,Rebate_Lookup[[#This Row],[MOQ_2]]<=Rebate_Lookup[[#This Row],[Order Form Quantity]],Rebate_Lookup[[#This Row],[Order Form Quantity]]<Rebate_Lookup[[#This Row],[MOQ_3]]),2,IF(AND(Rebate_Lookup[[#This Row],[Instances]]=3,Rebate_Lookup[[#This Row],[Order Form Quantity]]>=Rebate_Lookup[[#This Row],[MOQ_3]]),3))))))","v":{"$error":"#N/A"}},{"$f":"COUNTIF('2025 NOW-CALCULATOR - UNITS'!A:A,Rebate_Lookup[[#This Row],[SKU CODE]])","v":0},{"$f":"IFERROR(Rebate_Lookup[[#This Row],[Order Form Quantity]]>=Rebate_Lookup[[#This Row],[MOQ_2]],0)","v":0},null,{"$f":"COUNTIF('2025 NOW-CALCULATOR - UNITS'!A:A,Rebate_Lookup[[#This Row],[SKU CODE]])","v":0}]
{"$rows_left_out":38}
{"sheet":"2025 NOW_EOP_LL","index":3,"n_rows":123,"n_cols":32,"rows_kept":123,"cut":false,"hidden":true,"merged":[]}
["Manufacturer","Agency/TT","Segment","Region","Indication","Vol Buys","Program","Old Bayer SKU ","Old Envu SKU","SKU","Product","Size","2025 In-Season Price","NOW Price","In SZN-NOW delta","Min Qty","Rebate $","Final Price","CA In-season Price","CA NOW Price","CA Final Price","WA In-season Price","WA NOW Price","WA Final Price","Package Ounces","Standard Use Rate (oz/M)","Standard Use Rate (oz/Acre)","Price/1000 sq ft","Price/Acre","Total %","*cumlative","Set"]
["Envu","A","G","NST","F","X","NOW",79895402,null,"D00000907","Banol®","2.5 gal ",1267,1267,0,null,null,1267,1302.1600000000001,1302.1600000000001,1302.1600000000001,1275.8499999999999,1275.8499999999999,1275.8499999999999,320,2,87.12,7.9187500000000002,344.94075000000004,0,null,1]
["Envu","A","G","NST","F","X","NOW",79895402,null,"D00000907","Banol®","2.5 gal ",1267,1267,0,"2+",90,1177,1302.1600000000001,1302.1600000000001,1212.1600000000001,1275.8499999999999,1275.8499999999999,1185.8499999999999,320,2,87.12,7.3562500000000002,320.43825000000004,7.1033938437253363E-2,null,{"$f":"IF(PRICING[[#This Row],[SKU]]=J2,AF2+1,1)","v":2}]
["Envu","A","G","NST","F","X","NOW",null,null,"D00000623","Castlon™","1 gal",2748.2,2610.79,137.40999999999985,null,null,2610.79,2824.46,2683.24,2683.24,2767.44,2629.07,2629.07,128,0.36,15.6816,7.3428468749999993,319.85440987499999,4.9999999999999933E-2,null,{"$f":"IF(PRICING[[#This Row],[SKU]]=J3,AF3+1,1)","v":1}]
["Envu","A","G","NST","F","X","NOW",null,null,"D00000623","Castlon™","1 gal",2748.2,2610.79,137.40999999999985,"5-9",525,2085.79,2824.46,2683.24,2158.2399999999998,2767.44,2629.07,2104.0700000000002,128,0.36,15.6816,5.8662843749999993,255.53534737499999,0.24103413143148233,null,{"$f":"IF(PRICING[[#This Row],[SKU]]=J4,AF4+1,1)","v":2}]
["Envu","A","G","NST","F","X","NOW",null,null,"D00000623","Castlon™","1 gal",2748.2,2610.79,137.40999999999985,"10+",585,2025.79,2824.46,2683.24,2098.2399999999998,2767.44,2629.07,2044.0700000000002,128,0.36,15.6816,5.697534375,248.18459737499998,0.26286660359508041,null,{"$f":"IF(PRICING[[#This Row],[SKU]]=J5,AF5+1,1)","v":3}]
["Envu","A","GL","ST","H","X","NOW",null,null,79714858,"Celsius® WG","10 oz",131.19999999999999,124.64,6.5599999999999881,null,null,124.64,134.84,128.1,128.1,132.12,125.51,125.51,10,8.4940312213039507E-2,3.7000000000000011,1.0586960514233243,46.116800000000012,4.9999999999999933E-2,null,{"$f":"IF(PRICING[[#This Row],[SKU]]=J6,AF6+1,1)","v":1}]
["Envu","A","GL","ST","H","X","NOW",null,null,79714858,"Celsius® WG","10 oz",131.19999999999999,124.64,6.5599999999999881,"48+",12,112.64,134.84,128.1,116.1,132.12,125.51,113.51,10,8.4940312213039507E-2,3.7000000000000011,0.95676767676767693,41.676800000000007,0.14146341463414625,null,{"$f":"IF(PRICING[[#This Row],[SKU]]=J7,AF7+1,1)","v":2}]
["Envu","A","GL","ST","H","X","NOW","86773201",null,"D00000911","Celsius® XTRA","10 oz",166.4,158.08000000000001,8.3199999999999932,null,null,158.08000000000001,"NA","NA","NA",167.56,159.19,159.19,10,0.17217630853994489,7.5,2.721763085399449,118.56000000000002,4.9999999999999933E-2,null,{"$f":"IF(PRICING[[#This Row],[SKU]]=J8,AF8+1,1)","v":1}]
["Envu","A","GL","ST","H","X","NOW","86773201",null,"D00000911","Celsius® XTRA","10 oz",166.4,158.08000000000001,8.3199999999999932,"16+",12,146.08000000000001,"NA","NA","NA",167.56,159.19,147.19,10,0.17217630853994489,7.5,2.5151515151515151,109.56,0.12211538461538463,null,{"$f":"IF(PRICING[[#This Row],[SKU]]=J9,AF9+1,1)","v":2}]
{"$rows_left_out":114}
{"sheet":"Sheet4","index":4,"n_rows":57,"n_cols":5,"rows_kept":57,"cut":false,"hidden":true,"merged":[]}
[]
[]
["SKU","Product","Program","Agency/TT","NOW Price"]
[427709,"Sencor 75","NOW","TT",710.1]
[3944704,"Forbid","NOW","TT",304.73999999999995]
[11003880,"Rayora","NOW","A",631.4]
[11008336,"Dismiss® Turf Herbicide","NOW","TT",363.59999999999997]
[11008351,"Blindside® Herbicide ","NOW","TT",166.86]
[11008357,"Dismiss® CA Herbicide","NOW","TT",81.78]
[11008447,"QuickSilver® ","NOW","TT",199.92]
{"$rows_left_out":47}