{"text_format":"1","workbook":"xlsx","n_sheets":3,"sheets":["2024 FALL CALCULATOR","SUMMARY","Pricing"],"not_rendered":{"charts":0,"images":11,"macros":1,"external_links":0,"defined_names":15,"comments":1,"pivot_tables":0},"unopened":[],"bounds":{"document_bytes":16777216,"sheet_cells":100000,"rows_first":2000,"rows_last":500,"rows_between":2000,"halvings":0,"cell_chars":16384,"cell_head_chars":4096},"cells_cut":0,"cells_raw":0,"read":"whole","date_system":"1900"}

{"sheet":"2024 FALL CALCULATOR","index":0,"n_rows":107,"n_cols":52,"rows_kept":107,"cut":false,"hidden":false,"merged":[[66,51,68,51],[66,24,68,24],[66,25,68,25],[66,26,68,26],[66,27,68,27],[66,28,68,28],[66,29,68,29],[66,30,68,30],[66,31,68,31],[66,32,68,32],[66,33,68,33],[66,34,68,34],[66,38,68,38],[66,39,68,39],[24,31,26,31],[55,30,58,30],[66,50,68,50],[66,48,68,48],[66,49,68,49],[24,48,26,48],[24,49,26,49],[24,38,26,38],[24,39,26,39],[24,37,26,37],[24,30,26,30],[24,29,26,29],[66,37,68,37],[24,27,26,27],[24,28,26,28],[66,1,68,1],[55,1,58,1],[24,16,26,16],[24,14,25,14],[24,7,26,7],[24,8,26,8],[49,1,51,1],[24,26,26,26],[66,12,68,12],[66,13,68,13],[66,17,68,17],[24,20,26,20],[106,1,106,4],[24,25,26,25],[24,9,26,9],[24,10,26,10],[24,1,26,1],[24,2,26,2],[24,3,26,3],[24,4,26,4],[24,6,26,6],[24,19,26,19],[24,24,26,24],[24,15,26,15],[102,1,102,3],[100,1,100,3],[24,5,26,5],[101,1,101,3],[103,1,103,3],[104,1,104,3],[98,1,98,3],[99,1,99,3],[66,16,68,16],[97,1,97,3],[96,1,96,3],[84,1,87,1],[66,11,67,11],[66,2,68,2],[66,3,68,3],[66,4,68,4],[66,5,68,5],[66,6,68,6],[66,7,68,7],[24,21,26,21],[66,21,68,21],[94,1,94,4],[66,14,67,14],[66,15,68,15],[66,8,68,8],[24,18,26,18],[66,9,68,9],[66,10,68,10],[66,18,68,18],[66,19,68,19],[66,20,68,20],[44,1,46,1],[15,1,15,2],[24,11,25,11],[24,13,26,13],[24,12,26,12],[24,17,26,17]]}
[null,null,null,null,null,null,null,null,null,null,{"$f":" V13","v":"Fall Solutions National Calculator - version 2024-0009-0017"}]
[]
[null,{"$f":"IF(C22=\"National\", \"NATIONAL\", IF(C22=\"CA\",\"CALIFORNIA\",\"WASHINGTON\"))","v":"NATIONAL"},{"$f":" B3& \" 2024 FALL SOLUTIONS CALCULATOR\"","v":"NATIONAL 2024 FALL SOLUTIONS CALCULATOR"}]
[]
[null,null,null,null,null,null,null,null,null,null,null,null,null,null,null,null,null,null,null,null,null,"2024-0009-0017"]
[]
[]
[]
[]
[]
[]
[]
[null,null,null,null,null,null,null,null,null,null,null,null,null,null,null,null,null,null,null,null,null,{"$f":" \"Fall Solutions National Calculator - version \" & V5","v":"Fall Solutions National Calculator - version 2024-0009-0017"}]
[]
[null,null,null,null,null,null,null,null,null,null,null,null,null,null,null,null,null,null,null,null,null,null,null,null,null,null,null,null,null,null,null,null,null,null,null,null,null,"TOTAL PURCHASE REBATE"]
[null,"NAME YOUR DRAFT ORDER HERE:",null,null,null,null,null,null,null,null,null,null,null,null,null,null,null,null,null,null,null,null,null,null,null,null,null,null,null,null,null,null,null,null,null,null,null,"MINIMUM QTY","MAXIMUM QTY","REBATE %"]
[null,"Description: ",null,null,null,null,null,null,null,null,null,null,null,null,null,null,null,null,null,null,null,null,null,null,null,null,null,null,null,null,null,null,null,null,null,null,null,5000,13999,0.03]
[null,"Dist/DSR: ",null,null,null,null,null,null,null,null,null,null,null,null,null,null,null,null,null,null,null,null,null,null,null,"ADMIN COLUMNS",null,null,null,null,null,null,null,null,null,null,null,14000,22499,0.04]
[null,"MER#: ",null,null,null,null,null,null,null,null,null,null,null,null,null,null,null,null,null,null,null,null,null,null,null,null,null,null,null,null,null,null,null,null,null,null,null,22500,31499,0.05]
[null,"Last Updated: ",null,null,null,null,null,null,null,null,null,null,null,null,null,null,null,null,null,null,null,null,null,null,null,null,null,null,null,null,null,null,null,null,null,null,null,31500,39999,0.06]
[null,"Created For: ",null,null,null,null,null,null,null,null,null,null,null,null,null,null,null,null,null,null,null,null,null,null,null,null,null,null,null,null,null,null,null,null,null,null,null,40000,48499,0.08]
[null,"Region:","National",null,null,null,null,null,null,null,null,null,null,null,null,null,null,null,null,null,null,null,null,null,null,null,null,null,null,null,null,null,null,null,null,null,null,48500,999999.99,0.09]
[null,null,null,null,null,"HIDE","HIDE",null,null,null,null,null,null,null,null,null,null,null,null,null,null,null,null,null,"HIDE",null,"HIDE",null,null,null,null,null,null,null,null,null,null,"HIDE","HIDE","HIDE","HIDE","HIDE","HIDE","HIDE","HIDE","HIDE","HIDE","HIDE","HIDE","HIDE","HIDE","HIDE"]
[null,null,null,null,null,null,null,null,null,null,null,null,null,null,null,null,null,null,null,null,null,null,null,null,"SELECT REBATE",null,"PAIRING REBATE",null,null,"SPECTICLE FLO LOYALTY BONUS",null,null,"MIRACAST",null,null,"LARGE LAWN",null,"PURCHASE TIER REBATE"]
[null,"REBATE FINDER. (Minimum Program Purchase to receive rebates is $5,000)","PRODUCT NAME","UNIT SIZE","# UNITS","INSEASON PRICE","INSEASON SUBTOTAL","PRICE/\nUNIT*","INVOICE SUBTOTAL ($5,000 minimum across NOW/FALL program  to receive  rebates)","SELECT REBATES**†","PAIRING REBATES**†","SPECTICLE FLO LOYALTY BONUS**†","Specticle Flo Large Lawn User Rebate **†","STRATEGIC PARTNER REBATE/unit **†","PURCHASE TIER REBATE**†","NET PRICE/UNIT (all rebates, incl. purchase tier)","TOTAL AFTER REBATE","USE RATE / 1,000 FT2","INTENDED/\nACRE \nUSE RATE","TOTAL ACRES TREATED","COST/ ACRE","COST/          \n1,000 FT2",null,null,"Required Qty","Rebate","Required Qty","Qualify?","Rebate ","Brands Qualifying","Total Brands/ Specticle Tier","Specticle Bonus",null,null,null,null,null,"Aug - Oct Early Pay Bonus","Purchase Tier Rebate","Total must be > $5000 to qualify for rebates",null,null,null,null,null,null,null,null,"National Price","National invoice for rebate calculations"]
[null,null,null,null,null,null,null,null,null,null,null,null,null,null,null,null,null,null,null,null,null,null,null,null,null,null,null,null,null,null,null,null,null,null,null,null,null,null,null,null,null,"Specticle FLO Loyalty Bonus Matrix"]
[null,null,null,null,null,null,null,null,null,null,null,{"$f":"IFERROR(_xlfn.XLOOKUP($AE$56,$AP$31:$AP$34,_xlfn.XLOOKUP(AE32,$AQ$27:$AS$27,$AQ$31:$AS$34)),0)","v":0},null,null,{"$f":"IF(AND(I92<>\"\",AM92>0),IF(AM92>0.07,AM92,(AM92+0.01)),0)","v":0.04},null,null,null,null,null,null,null,null,null,null,null,null,null,null,null,null,null,null,null,null,null,null,null,null,null,null,"Tiers/Brands",1,2,3]
[null,"Purchase Tier","Altus (64 fl.oz. bottle), 1-15","64 fl oz",null,{"$f":"INDEX(Pricing!$E$5:$G$100,MATCH('2024 FALL CALCULATOR'!$C28,Pricing!$A$5:$A$100,0),MATCH($C$22,Pricing!$E$4:$G$4,0))","v":428.4},{"$f":"IF(ISERROR(E28*F28),\"\",E28*F28)","v":0},{"$f":"INDEX(Pricing!$A$5:$D$100,MATCH('2024 FALL CALCULATOR'!$C28,Pricing!$A$5:$A$100,0),MATCH($C$22,Pricing!$A$4:$D$4,0))","v":428.4},{"$f":"IF(ISERROR(E28*H28),0,E28*H28)","v":0},null,null,null,null,null,{"$f":"IF(OR(AW28 =\"\",AL28+AM28=0),0,E28*AW28*(AL28+AM28))","v":0},{"$f":"IF(AND(E28<>\"\",E28>0),(H28-((SUM(J28:M28)+N28*E28+O28)/E28)),\"\")","v":""},{"$f":"IF(AND(E28<>\"\",E28>0), E28*P28,\"\")","v":""},{"$f":"S28/43.56","v":0.16069788797061524},7,{"$f":"IF(AND(TRIM(S28)<>\"\",TRIM(E28)<>\"\"),(E28*64)/S28,\"\")","v":""},{"$f":"IF(E28<>0,Q28/T28,0)","v":0},{"$f":"U28/43.56","v":0},null,null,null,null,null,null,null,null,null,null,null,null,null,null,null,{"$f":"IF(AND(E28 <>\"\",AN$92>=5000,AM$92<=0.07),0.01,0)","v":0},{"$f":"IF(E28 <>\"\", AM$92,0)","v":0},{"$f":"IF(E28 = \"\",0,IFERROR(H28*E28,0))","v":0},null,null,null,null,null,null,null,null,{"$f":"INDEX(Pricing!$A$5:$D$100,MATCH('2024 FALL CALCULATOR'!$C28,Pricing!$A$5:$A$100,0),MATCH(\"National\",Pricing!$A$4:$D$4,0))","v":428.4},{"$f":"AW28*E28","v":0}]
[null,"Purchase Tier","Altus (64 fl.oz. bottle), 16-31","64 fl oz",null,{"$f":"INDEX(Pricing!$E$5:$G$100,MATCH('2024 FALL CALCULATOR'!$C29,Pricing!$A$5:$A$100,0),MATCH($C$22,Pricing!$E$4:$G$4,0))","v":428.4},{"$f":"IF(ISERROR(E29*F29),\"\",E29*F29)","v":0},{"$f":"INDEX(Pricing!$A$5:$D$100,MATCH('2024 FALL CALCULATOR'!$C29,Pricing!$A$5:$A$100,0),MATCH($C$22,Pricing!$A$4:$D$4,0))","v":406.98},0,null,null,null,null,null,{"$f":"IF(OR(AW29 =\"\",AL29+AM29=0),0,E29*AW29*(AL29+AM29))","v":0},"",{"$f":"IF(AND(E29<>\"\",E29>0), E29*P29,\"\")","v":""},{"$f":"S29/43.56","v":0.16069788797061524},7,{"$f":"IF(AND(TRIM(S29)<>\"\",TRIM(E29)<>\"\"),(E29*64)/S29,\"\")","v":""},{"$f":"IF(E29<>0,Q29/T29,0)","v":0},0,null,null,null,null,null,null,null,null,null,null,null,null,null,null,null,0,0,0,null,null,null,null,null,null,null,null,{"$f":"INDEX(Pricing!$A$5:$D$100,MATCH('2024 FALL CALCULATOR'!$C29,Pricing!$A$5:$A$100,0),MATCH(\"National\",Pricing!$A$4:$D$4,0))","v":406.98},{"$f":"AW29*E29","v":0}]
[null,"Purchase Tier","Altus (64 fl.oz. bottle), 32+","64 fl oz",null,{"$f":"INDEX(Pricing!$E$5:$G$100,MATCH('2024 FALL CALCULATOR'!$C30,Pricing!$A$5:$A$100,0),MATCH($C$22,Pricing!$E$4:$G$4,0))","v":428.4},0,{"$f":"INDEX(Pricing!$A$5:$D$100,MATCH('2024 FALL CALCULATOR'!$C30,Pricing!$A$5:$A$100,0),MATCH($C$22,Pricing!$A$4:$D$4,0))","v":385.56},0,null,null,null,null,null,0,"",{"$f":"IF(AND(E30<>\"\",E30>0), E30*P30,\"\")","v":""},{"$f":"S30/43.56","v":0.16069788797061524},7,"",{"$f":"IF(E30<>0,Q30/T30,0)","v":0},0,null,null,null,null,null,null,null,null,null,null,null,null,null,null,null,0,0,0,null,null,null,null,null,null,null,null,{"$f":"INDEX(Pricing!$A$5:$D$100,MATCH('2024 FALL CALCULATOR'!$C30,Pricing!$A$5:$A$100,0),MATCH(\"National\",Pricing!$A$4:$D$4,0))","v":385.56},0]
{"$rows_left_out":78}
{"sheet":"SUMMARY","index":1,"n_rows":96,"n_cols":7,"rows_kept":96,"cut":false,"hidden":false,"merged":[[81,1,81,5],[16,5,18,5],[16,6,18,6],[16,1,18,1],[16,2,18,2],[16,3,18,3],[16,4,18,4],[85,1,85,5],[86,1,86,5],[87,1,87,5],[88,1,88,5],[82,1,84,5],[89,1,89,5],[90,1,90,5],[91,1,91,5],[92,1,92,5],[93,1,93,5],[95,1,95,6],[14,2,14,6],[13,2,13,6],[8,1,8,6],[9,2,9,6],[10,2,10,6],[11,2,11,6],[12,2,12,6]]}
[]
[]
[]
[]
[]
[]
[]
[null,null,null,null,null,null,{"$f":"'2024 FALL CALCULATOR'!V13","v":"Fall Solutions National Calculator - version 2024-0009-0017"}]
[null,{"$f":"'2024 FALL CALCULATOR'!B16","v":"NAME YOUR DRAFT ORDER HERE:"}]
[null,"Description: ",{"$f":"IF('2024 FALL CALCULATOR'!C17=\"\",\"\",'2024 FALL CALCULATOR'!C17)","v":""}]
[null,"Distributor/DSR: ",{"$f":"IF('2024 FALL CALCULATOR'!C18=\"\",\"\",'2024 FALL CALCULATOR'!C18)","v":""}]
[null,"MER#: ",{"$f":"IF('2024 FALL CALCULATOR'!C19=\"\",\"\",'2024 FALL CALCULATOR'!C19)","v":""}]
[null,"Last Updated: ",{"$f":"IF('2024 FALL CALCULATOR'!C20=\"\",\"\",'2024 FALL CALCULATOR'!C20)","v":""}]
[null,"Created For: ",{"$f":"IF('2024 FALL CALCULATOR'!C21=\"\",\"\",'2024 FALL CALCULATOR'!C21)","v":""}]
[null,"Region:",{"$f":"IF('2024 FALL CALCULATOR'!C22=\"\",\"\",'2024 FALL CALCULATOR'!C22)","v":"National"}]
[]
[null,"PRODUCT NAME","UNIT SIZE","# UNITS","PRICE/UNIT","SUBTOTAL","NET PRICE/UNIT"]
[]
[]
[null,{"$f":"'2024 FALL CALCULATOR'!C28","v":"Altus (64 fl.oz. bottle), 1-15"},{"$f":"'2024 FALL CALCULATOR'!D28","v":"64 fl oz"},{"$f":"'2024 FALL CALCULATOR'!E28","v":0},{"$f":"'2024 FALL CALCULATOR'!H28","v":428.4},{"$f":"'2024 FALL CALCULATOR'!I28","v":0},{"$f":"'2024 FALL CALCULATOR'!P28","v":""}]
[null,{"$f":"'2024 FALL CALCULATOR'!C29","v":"Altus (64 fl.oz. bottle), 16-31"},{"$f":"'2024 FALL CALCULATOR'!D29","v":"64 fl oz"},{"$f":"'2024 FALL CALCULATOR'!E29","v":0},{"$f":"'2024 FALL CALCULATOR'!H29","v":406.98},{"$f":"'2024 FALL CALCULATOR'!I29","v":0},{"$f":"'2024 FALL CALCULATOR'!P29","v":""}]
[null,{"$f":"'2024 FALL CALCULATOR'!C30","v":"Altus (64 fl.oz. bottle), 32+"},{"$f":"'2024 FALL CALCULATOR'!D30","v":"64 fl oz"},{"$f":"'2024 FALL CALCULATOR'!E30","v":0},{"$f":"'2024 FALL CALCULATOR'!H30","v":385.56},{"$f":"'2024 FALL CALCULATOR'!I30","v":0},{"$f":"'2024 FALL CALCULATOR'!P30","v":""}]
[null,{"$f":"'2024 FALL CALCULATOR'!C31","v":"Banol® "},{"$f":"'2024 FALL CALCULATOR'!D31","v":"2.5 gal. bottle"},{"$f":"'2024 FALL CALCULATOR'!E31","v":0},{"$f":"'2024 FALL CALCULATOR'!H31","v":1254},{"$f":"'2024 FALL CALCULATOR'!I31","v":0},{"$f":"'2024 FALL CALCULATOR'!P31","v":""}]
[null,{"$f":"'2024 FALL CALCULATOR'!C32","v":"Celsius"},{"$f":"'2024 FALL CALCULATOR'!D32","v":"10 oz. bottle"},{"$f":"'2024 FALL CALCULATOR'!E32","v":0},{"$f":"'2024 FALL CALCULATOR'!H32","v":128.4},{"$f":"'2024 FALL CALCULATOR'!I32","v":0},{"$f":"'2024 FALL CALCULATOR'!P32","v":""}]
[null,{"$f":"'2024 FALL CALCULATOR'!C33","v":"Celsius XTRA"},{"$f":"'2024 FALL CALCULATOR'!D33","v":"10 oz. bottle"},{"$f":"'2024 FALL CALCULATOR'!E33","v":0},{"$f":"'2024 FALL CALCULATOR'!H33","v":166.4},{"$f":"'2024 FALL CALCULATOR'!I33","v":0},{"$f":"'2024 FALL CALCULATOR'!P33","v":""}]
[null,{"$f":"'2024 FALL CALCULATOR'!C34","v":"Chipco Signature Stressgard (1-8 units)"},{"$f":"'2024 FALL CALCULATOR'!D34","v":"11 lb. bottle"},{"$f":"'2024 FALL CALCULATOR'!E34","v":0},{"$f":"'2024 FALL CALCULATOR'!H34","v":392.8},{"$f":"'2024 FALL CALCULATOR'!I34","v":0},{"$f":"'2024 FALL CALCULATOR'!P34","v":""}]
[null,{"$f":"'2024 FALL CALCULATOR'!C35","v":"Chipco Signature Stressgard (9+ units)"},{"$f":"'2024 FALL CALCULATOR'!D35","v":"11 lb. bottle"},{"$f":"'2024 FALL CALCULATOR'!E35","v":0},{"$f":"'2024 FALL CALCULATOR'!H35","v":368.8},{"$f":"'2024 FALL CALCULATOR'!I35","v":0},{"$f":"'2024 FALL CALCULATOR'!P35","v":""}]
[null,{"$f":"'2024 FALL CALCULATOR'!C36","v":"Castlon™ (1 gal.)"},{"$f":"'2024 FALL CALCULATOR'!D36","v":"1 gal. bottle"},{"$f":"'2024 FALL CALCULATOR'!E36","v":0},{"$f":"'2024 FALL CALCULATOR'!H36","v":2600},{"$f":"'2024 FALL CALCULATOR'!I36","v":0},{"$f":"'2024 FALL CALCULATOR'!P36","v":""}]
[null,{"$f":"'2024 FALL CALCULATOR'!C37","v":"Castlon™ (16oz.)"},{"$f":"'2024 FALL CALCULATOR'!D37","v":"16 oz. bottle"},{"$f":"'2024 FALL CALCULATOR'!E37","v":0},{"$f":"'2024 FALL CALCULATOR'!H37","v":366.5},{"$f":"'2024 FALL CALCULATOR'!I37","v":0},{"$f":"'2024 FALL CALCULATOR'!P37","v":""}]
[null,{"$f":"'2024 FALL CALCULATOR'!C38","v":"Densicor®"},{"$f":"'2024 FALL CALCULATOR'!D38","v":"51 oz. bottle"},{"$f":"'2024 FALL CALCULATOR'!E38","v":0},{"$f":"'2024 FALL CALCULATOR'!H38","v":739.6},{"$f":"'2024 FALL CALCULATOR'!I38","v":0},{"$f":"'2024 FALL CALCULATOR'!P38","v":""}]
{"$rows_left_out":67}
{"sheet":"Pricing","index":2,"n_rows":63,"n_cols":8,"rows_kept":63,"cut":false,"hidden":true,"merged":[[2,4,2,6]]}
[1,{"$f":"A1+1","v":2},{"$f":"B1+1","v":3},4,5]
[]
[null,null,null,null,"In Season Price"]
["Product","National","CA","WA","National","CA","WA","Dist Suggested Min Price (DSMP)"]
["26 GT®",503.9,503.9,503.9,503.9,503.9,503.9]
["Acclaim Accelerate (0.5 gal)",45.65,45.65,45.65,45.65,45.65,45.65,55]
["Acclaim Accelerate (2.5 gal)",219.95,219.95,219.95,219.95,219.95,219.95,265]
["Acclaim® Extra (1 gal)",665.2,665.2,665.2,665.2,665.2,665.2]
["Altus (64 fl.oz. bottle), 1-15",428.4,439.22,431.4,428.4,439.22,431.4]
["Altus (64 fl.oz. bottle), 16-31",406.98,417.26,409.82,428.4,439.22,431.4]
["Altus (64 fl.oz. bottle), 32+",385.56,395.3,388.26,428.4,439.22,431.4]
["Armada® 50 WDG",114,114,114,114,114,114]
["Banol® ",1254,1285.6500000000001,1262.8,1254,1285.6500000000001,1262.8]
["Castlon™ (1 gal.)",2600,"N/A",2618.1999999999998,2600,"N/A",2618.1999999999998]
["Castlon™ (16oz.)",366.5,"N/A",369.07,366.5,"N/A",369.07]
["Celsius",128.4,131.63999999999999,129.30000000000001,128.4,131.63999999999999,129.30000000000001]
["Celsius XTRA",166.4,"N/A",167.56,166.4,"N/A",167.56]
["Chipco Signature Stressgard (1-8 units)",392.8,402.72,395.54,392.8,402.72,395.54]
["Chipco Signature Stressgard (9+ units)",368.8,378.12,371.38,392.8,402.72,395.54]
["Chipco® Choice",161,161,161,161,161,161]
["Densicor®",739.6,"N/A",744.78,739.6,"N/A",744.78]
["Dylox 420 SL",218.75,218.75,218.75,218.75,218.75,218.75]
["Exteris® Stressgard®",366,375.25,368.55,366,375.25,368.55]
["Fiata® Stressgard®",190,194.8,191.35,190,194.8,191.35]
["Forbid® ",244.18,244.18,244.18,244.18,244.18,244.18]
["Indemnify® (1-2 units)",1963.6,2013.18,1977.34,1963.6,2013.18,1977.34]
["Indemnify® (3+ units)",1767.2,1811.82,1779.58,1963.6,2013.18,1977.34]
["Interface® Stressgard® (1-5 units)",561,575.15,564.95000000000005,561,575.15,564.95000000000005]
["Interface® Stressgard® (6+ units)",494,506.45,497.45,561,575.15,564.95000000000005]
["Merit 2F",40.15,40.15,40.15,40.15,40.15,40.15]
{"$rows_left_out":33}