{"text_format":"3","workbook":"xlsx","n_sheets":4,"sheets":["2025 ORNAMENTALS - UNITS","SUMMARY - UNITS (2025)","REBATE MATRIX (NOW)","2025 NOW_EOP_LL"],"not_rendered":{"images":2,"macros":1,"defined_names":19,"comments":2},"read":"whole","date_system":"1900"}

{"sheet":"2025 ORNAMENTALS - UNITS","index":0,"n_rows":60,"n_cols":34,"rows_kept":60,"merged":[[0,6,0,12],[3,5,3,6],[11,13,12,14],[13,0,15,0],[13,1,15,1],[13,2,15,2],[13,3,15,3],[13,5,15,5],[13,6,15,6],[13,7,15,7],[13,8,15,8],[13,9,15,9],[13,10,15,10],[13,11,15,11],[13,12,15,12],[13,13,14,13],[13,14,14,14],[13,15,15,15],[13,16,15,16],[16,2,18,2],[16,3,18,3],[16,6,18,6],[19,2,21,2],[19,3,21,3],[19,6,21,6],[22,2,24,2],[22,3,24,3],[22,6,24,6],[25,2,27,2],[25,3,27,3],[25,6,27,6],[28,2,30,2],[28,3,30,3],[28,6,30,6],[31,2,33,2],[31,3,33,3],[31,6,33,6],[47,5,47,8],[47,11,59,16],[49,5,49,6],[49,7,49,8],[50,5,50,6],[50,7,50,8],[51,5,51,6],[52,5,52,6],[53,5,53,6],[54,5,54,6],[55,5,55,6],[56,5,56,6],[57,5,57,6],[57,7,57,8],[59,5,59,8]]}
[{"$nulls":6},"         NATIONAL 2025 ORNAMENTALS SOLUTIONS CALCULATOR                  "]
[]
[{"$nulls":10},"AGENCY MULTI-BRAND REBATE",null,null,"PURCHASE TIER REBATE",{"$nulls":19},"National"]
[{"$nulls":5},"NAME YOUR DRAFT ORDER HERE:",{"$nulls":4},"QUALIFYING BRAND PURCHASES","MULTI-BRAND REBATE**†",null,"MINIMUM","MAXIMUM","BASE INCENTIVE†","SEPTEMBER BONUS","BASE + BONUS†",{"$nulls":14},"Yes","CA"]
[{"$nulls":5},"Description: ",{"$nulls":4},3,{"v":0.02,"d":"2%"},{"$f":"K5=$D$35","v":false},{"v":5000,"d":"$ 5,000"},{"v":19999,"d":"$ 19,999"},{"v":0.02,"d":"2%"},{"v":0.01,"d":"1%"},{"v":0.03,"d":"3%"},{"$f":"AND($T$5>=N5,$T$5<N6)","v":false},{"$f":"M35+SUM(M40:M44)","v":{"v":0,"d":"0.00"}},{"$nulls":12},"No","WA"]
[{"$nulls":5},"Dist/DSR: ",{"$nulls":4},4,{"v":0.03,"d":"3%"},{"$f":"K6=$D$35","v":false},{"v":20000,"d":"$ 20,000"},{"v":39999,"d":"$ 39,999"},{"v":0.03,"d":"3%"},{"v":0.01,"d":"1%"},{"v":0.04,"d":"4%"},{"$f":"AND($T$5>=N6,$T$5<N7)","v":false}]
[{"$nulls":5},"MER#: ",{"$nulls":4},5,{"v":0.04,"d":"4%"},{"$f":"K7<=$D$35","v":false},{"v":40000,"d":"$ 40,000"},{"v":74999,"d":"$ 74,999"},{"v":0.04,"d":"4%"},{"v":0.01,"d":"1%"},{"v":0.05,"d":"5%"},{"$f":"AND($T$5>=N7,$T$5<N8)","v":false}]
[{"$nulls":5},"Last Updated: ",{"$nulls":7},{"v":75000,"d":"$ 75,000"},{"v":1000000,"d":"$ 1,000,000"},{"v":0.05,"d":"5%"},{"v":0.01,"d":"1%"},{"v":0.06,"d":"6%"},{"$f":"AND($T$5>=N8)","v":false}]
[{"$nulls":5},"Created For: "]
[{"$nulls":5},"Region:","National",{"$nulls":6},"Count Sept. Bonus?","Yes"]
{"$rows_left_out":51}
{"sheet":"SUMMARY - UNITS (2025)","index":1,"n_rows":53,"n_cols":10,"rows_kept":53,"merged":[[1,2,1,6],[2,3,2,6],[3,3,3,6],[4,3,4,6],[5,3,5,6],[6,3,6,6],[7,3,7,6],[9,2,11,2],[9,3,11,3],[9,4,11,4],[9,5,11,5],[9,6,11,6],[9,7,11,7],[9,8,11,8],[9,9,11,9],[12,2,14,2],[15,2,17,2],[18,2,20,2],[21,2,23,2],[24,2,26,2],[27,2,29,2],[38,2,39,8],[40,2,40,5],[40,6,40,7],[41,2,41,5],[41,6,41,7],[42,2,42,5],[43,2,43,7],[44,2,44,5],[45,2,45,5],[46,2,46,5],[47,2,47,5],[48,2,48,5],[48,6,48,7],[50,2,50,7],[52,2,63,9]]}
[]
[null,null,{"$f":"'2025 ORNAMENTALS - UNITS'!F4","v":"NAME YOUR DRAFT ORDER HERE:"}]
[null,null,{"$f":"'2025 ORNAMENTALS - UNITS'!F5","v":"Description: "}]
[null,null,{"$f":"'2025 ORNAMENTALS - UNITS'!F6","v":"Dist/DSR: "}]
[null,null,{"$f":"'2025 ORNAMENTALS - UNITS'!F7","v":"MER#: "}]
[null,null,{"$f":"'2025 ORNAMENTALS - UNITS'!F8","v":"Last Updated: "}]
[null,null,{"$f":"'2025 ORNAMENTALS - UNITS'!F9","v":"Created For: "}]
[null,null,{"$f":"'2025 ORNAMENTALS - UNITS'!F10","v":"Region:"}]
[null,null,"Page 1 of 1"]
[null,null,"PRODUCT NAME","Volume Tier","# UNITS","ORIGINAL PRICE/UNIT","EOP \nPRICE/UNIT","SUBTOTAL\n(before rebates)","NET PRICE/UNIT\n(after rebate)","SUBTOTAL\n(after rebate)"]
{"$rows_left_out":44}
{"sheet":"REBATE MATRIX (NOW)","index":2,"n_rows":46,"n_cols":18,"rows_kept":46,"hidden":true}
[{"$nulls":15},{"$f":"COUNTIF(Rebate_Lookup[Volume Buy Counter],TRUE)","v":0}]
[null,"SKU CODE","Agency/TT","Description","Size","Instances","MOQ_1","MOQ_2","MOQ_3","REB_MOQ_1","REB_MOQ_2","REB_MOQ_3","Order Form Quantity","Qualified Rebate Tier","Column1","Volume Buy Counter"]
[null,"D00000903","A","Altus®","64 oz",2,1,16,32,{"$nulls":3},{"$f":"INDEX('2025 ORNAMENTALS - UNITS'!I:I,MATCH(Rebate_Lookup[[#This Row],[SKU CODE]],'2025 ORNAMENTALS - UNITS'!A:A,0))","v":0},{"$f":"IF(Rebate_Lookup[[#This Row],[Instances]]=1,1,\nIF(AND(Rebate_Lookup[[#This Row],[Instances]]=2,Rebate_Lookup[[#This Row],[Order Form Quantity]]<Rebate_Lookup[[#This Row],[MOQ_2]]),1,IF(AND(Rebate_Lookup[[#This Row],[Instances]]=2,Rebate_Lookup[[#This Row],[Order Form Quantity]]>=Rebate_Lookup[[#This Row],[MOQ_2]]),2,\nIF(AND(Rebate_Lookup[[#This Row],[Instances]]=3,Rebate_Lookup[[#This Row],[Order Form Quantity]]<Rebate_Lookup[[#This Row],[MOQ_2]]),1,IF(AND(Rebate_Lookup[[#This Row],[Instances]]=3,Rebate_Lookup[[#This Row],[MOQ_2]]<=Rebate_Lookup[[#This Row],[Order Form Quantity]],Rebate_Lookup[[#This Row],[Order Form Quantity]]<Rebate_Lookup[[#This Row],[MOQ_3]]),2,IF(AND(Rebate_Lookup[[#This Row],[Instances]]=3,Rebate_Lookup[[#This Row],[Order Form Quantity]]>=Rebate_Lookup[[#This Row],[MOQ_3]]),3))))))","v":1},{"$f":"COUNTIF('2025 ORNAMENTALS - UNITS'!A:A,Rebate_Lookup[[#This Row],[SKU CODE]])","v":3},{"$f":"IFERROR(Rebate_Lookup[[#This Row],[Order Form Quantity]]>=Rebate_Lookup[[#This Row],[MOQ_2]],0)","v":false},null,{"$f":"COUNTIF('2025 ORNAMENTALS - UNITS'!A:A,Rebate_Lookup[[#This Row],[SKU CODE]])","v":3}]
[null,"D00000908","A","Broadform","12 oz",2,1,16,32,{"$nulls":3},{"$f":"INDEX('2025 ORNAMENTALS - UNITS'!I:I,MATCH(Rebate_Lookup[[#This Row],[SKU CODE]],'2025 ORNAMENTALS - UNITS'!A:A,0))","v":0},{"$f":"IF(Rebate_Lookup[[#This Row],[Instances]]=1,1,\nIF(AND(Rebate_Lookup[[#This Row],[Instances]]=2,Rebate_Lookup[[#This Row],[Order Form Quantity]]<Rebate_Lookup[[#This Row],[MOQ_2]]),1,IF(AND(Rebate_Lookup[[#This Row],[Instances]]=2,Rebate_Lookup[[#This Row],[Order Form Quantity]]>=Rebate_Lookup[[#This Row],[MOQ_2]]),2,\nIF(AND(Rebate_Lookup[[#This Row],[Instances]]=3,Rebate_Lookup[[#This Row],[Order Form Quantity]]<Rebate_Lookup[[#This Row],[MOQ_2]]),1,IF(AND(Rebate_Lookup[[#This Row],[Instances]]=3,Rebate_Lookup[[#This Row],[MOQ_2]]<=Rebate_Lookup[[#This Row],[Order Form Quantity]],Rebate_Lookup[[#This Row],[Order Form Quantity]]<Rebate_Lookup[[#This Row],[MOQ_3]]),2,IF(AND(Rebate_Lookup[[#This Row],[Instances]]=3,Rebate_Lookup[[#This Row],[Order Form Quantity]]>=Rebate_Lookup[[#This Row],[MOQ_3]]),3))))))","v":1},{"$f":"COUNTIF('2025 ORNAMENTALS - UNITS'!A:A,Rebate_Lookup[[#This Row],[SKU CODE]])","v":3},{"$f":"IFERROR(Rebate_Lookup[[#This Row],[Order Form Quantity]]>=Rebate_Lookup[[#This Row],[MOQ_2]],0)","v":false},null,{"$f":"COUNTIF('2025 ORNAMENTALS - UNITS'!A:A,Rebate_Lookup[[#This Row],[SKU CODE]])","v":3}]
[null,"D00001272","A","Kontos","1 qt",2,1,4,16,{"$nulls":3},{"$f":"INDEX('2025 ORNAMENTALS - UNITS'!I:I,MATCH(Rebate_Lookup[[#This Row],[SKU CODE]],'2025 ORNAMENTALS - UNITS'!A:A,0))","v":0},{"$f":"IF(Rebate_Lookup[[#This Row],[Instances]]=1,1,\nIF(AND(Rebate_Lookup[[#This Row],[Instances]]=2,Rebate_Lookup[[#This Row],[Order Form Quantity]]<Rebate_Lookup[[#This Row],[MOQ_2]]),1,IF(AND(Rebate_Lookup[[#This Row],[Instances]]=2,Rebate_Lookup[[#This Row],[Order Form Quantity]]>=Rebate_Lookup[[#This Row],[MOQ_2]]),2,\nIF(AND(Rebate_Lookup[[#This Row],[Instances]]=3,Rebate_Lookup[[#This Row],[Order Form Quantity]]<Rebate_Lookup[[#This Row],[MOQ_2]]),1,IF(AND(Rebate_Lookup[[#This Row],[Instances]]=3,Rebate_Lookup[[#This Row],[MOQ_2]]<=Rebate_Lookup[[#This Row],[Order Form Quantity]],Rebate_Lookup[[#This Row],[Order Form Quantity]]<Rebate_Lookup[[#This Row],[MOQ_3]]),2,IF(AND(Rebate_Lookup[[#This Row],[Instances]]=3,Rebate_Lookup[[#This Row],[Order Form Quantity]]>=Rebate_Lookup[[#This Row],[MOQ_3]]),3))))))","v":1},{"$f":"COUNTIF('2025 ORNAMENTALS - UNITS'!A:A,Rebate_Lookup[[#This Row],[SKU CODE]])","v":3},{"$f":"IFERROR(Rebate_Lookup[[#This Row],[Order Form Quantity]]>=Rebate_Lookup[[#This Row],[MOQ_2]],0)","v":false},null,{"$f":"COUNTIF('2025 ORNAMENTALS - UNITS'!A:A,Rebate_Lookup[[#This Row],[SKU CODE]])","v":3}]
[null,"D00000946","A","Marengo FLO","64 oz",2,1,4,16,{"$nulls":3},{"$f":"INDEX('2025 ORNAMENTALS - UNITS'!I:I,MATCH(Rebate_Lookup[[#This Row],[SKU CODE]],'2025 ORNAMENTALS - UNITS'!A:A,0))","v":0},{"$f":"IF(Rebate_Lookup[[#This Row],[Instances]]=1,1,\nIF(AND(Rebate_Lookup[[#This Row],[Instances]]=2,Rebate_Lookup[[#This Row],[Order Form Quantity]]<Rebate_Lookup[[#This Row],[MOQ_2]]),1,IF(AND(Rebate_Lookup[[#This Row],[Instances]]=2,Rebate_Lookup[[#This Row],[Order Form Quantity]]>=Rebate_Lookup[[#This Row],[MOQ_2]]),2,\nIF(AND(Rebate_Lookup[[#This Row],[Instances]]=3,Rebate_Lookup[[#This Row],[Order Form Quantity]]<Rebate_Lookup[[#This Row],[MOQ_2]]),1,IF(AND(Rebate_Lookup[[#This Row],[Instances]]=3,Rebate_Lookup[[#This Row],[MOQ_2]]<=Rebate_Lookup[[#This Row],[Order Form Quantity]],Rebate_Lookup[[#This Row],[Order Form Quantity]]<Rebate_Lookup[[#This Row],[MOQ_3]]),2,IF(AND(Rebate_Lookup[[#This Row],[Instances]]=3,Rebate_Lookup[[#This Row],[Order Form Quantity]]>=Rebate_Lookup[[#This Row],[MOQ_3]]),3))))))","v":1},{"$f":"COUNTIF('2025 ORNAMENTALS - UNITS'!A:A,Rebate_Lookup[[#This Row],[SKU CODE]])","v":3},{"$f":"IFERROR(Rebate_Lookup[[#This Row],[Order Form Quantity]]>=Rebate_Lookup[[#This Row],[MOQ_2]],0)","v":false},null,{"$f":"COUNTIF('2025 ORNAMENTALS - UNITS'!A:A,Rebate_Lookup[[#This Row],[SKU CODE]])","v":3}]
[null,"D00000945","A","Marengo G","50 lb",2,1,40,120,{"$nulls":3},{"$f":"INDEX('2025 ORNAMENTALS - UNITS'!I:I,MATCH(Rebate_Lookup[[#This Row],[SKU CODE]],'2025 ORNAMENTALS - UNITS'!A:A,0))","v":0},{"$f":"IF(Rebate_Lookup[[#This Row],[Instances]]=1,1,\nIF(AND(Rebate_Lookup[[#This Row],[Instances]]=2,Rebate_Lookup[[#This Row],[Order Form Quantity]]<Rebate_Lookup[[#This Row],[MOQ_2]]),1,IF(AND(Rebate_Lookup[[#This Row],[Instances]]=2,Rebate_Lookup[[#This Row],[Order Form Quantity]]>=Rebate_Lookup[[#This Row],[MOQ_2]]),2,\nIF(AND(Rebate_Lookup[[#This Row],[Instances]]=3,Rebate_Lookup[[#This Row],[Order Form Quantity]]<Rebate_Lookup[[#This Row],[MOQ_2]]),1,IF(AND(Rebate_Lookup[[#This Row],[Instances]]=3,Rebate_Lookup[[#This Row],[MOQ_2]]<=Rebate_Lookup[[#This Row],[Order Form Quantity]],Rebate_Lookup[[#This Row],[Order Form Quantity]]<Rebate_Lookup[[#This Row],[MOQ_3]]),2,IF(AND(Rebate_Lookup[[#This Row],[Instances]]=3,Rebate_Lookup[[#This Row],[Order Form Quantity]]>=Rebate_Lookup[[#This Row],[MOQ_3]]),3))))))","v":1},{"$f":"COUNTIF('2025 ORNAMENTALS - UNITS'!A:A,Rebate_Lookup[[#This Row],[SKU CODE]])","v":3},{"$f":"IFERROR(Rebate_Lookup[[#This Row],[Order Form Quantity]]>=Rebate_Lookup[[#This Row],[MOQ_2]],0)","v":false},null,{"$f":"COUNTIF('2025 ORNAMENTALS - UNITS'!A:A,Rebate_Lookup[[#This Row],[SKU CODE]])","v":3}]
[null,"D00000987","A","Savate","8 oz",2,1,12,30,{"$nulls":3},{"$f":"INDEX('2025 ORNAMENTALS - UNITS'!I:I,MATCH(Rebate_Lookup[[#This Row],[SKU CODE]],'2025 ORNAMENTALS - UNITS'!A:A,0))","v":0},{"$f":"IF(Rebate_Lookup[[#This Row],[Instances]]=1,1,\nIF(AND(Rebate_Lookup[[#This Row],[Instances]]=2,Rebate_Lookup[[#This Row],[Order Form Quantity]]<Rebate_Lookup[[#This Row],[MOQ_2]]),1,IF(AND(Rebate_Lookup[[#This Row],[Instances]]=2,Rebate_Lookup[[#This Row],[Order Form Quantity]]>=Rebate_Lookup[[#This Row],[MOQ_2]]),2,\nIF(AND(Rebate_Lookup[[#This Row],[Instances]]=3,Rebate_Lookup[[#This Row],[Order Form Quantity]]<Rebate_Lookup[[#This Row],[MOQ_2]]),1,IF(AND(Rebate_Lookup[[#This Row],[Instances]]=3,Rebate_Lookup[[#This Row],[MOQ_2]]<=Rebate_Lookup[[#This Row],[Order Form Quantity]],Rebate_Lookup[[#This Row],[Order Form Quantity]]<Rebate_Lookup[[#This Row],[MOQ_3]]),2,IF(AND(Rebate_Lookup[[#This Row],[Instances]]=3,Rebate_Lookup[[#This Row],[Order Form Quantity]]>=Rebate_Lookup[[#This Row],[MOQ_3]]),3))))))","v":1},{"$f":"COUNTIF('2025 ORNAMENTALS - UNITS'!A:A,Rebate_Lookup[[#This Row],[SKU CODE]])","v":3},{"$f":"IFERROR(Rebate_Lookup[[#This Row],[Order Form Quantity]]>=Rebate_Lookup[[#This Row],[MOQ_2]],0)","v":false},null,{"$f":"COUNTIF('2025 ORNAMENTALS - UNITS'!A:A,Rebate_Lookup[[#This Row],[SKU CODE]])","v":3}]
[null,11008513,"TT","Aria® Insecticide  ","160 g",2,1,8,null,0,{"v":21,"d":"$21.00"},null,{"$f":"INDEX('2025 ORNAMENTALS - UNITS'!I:I,MATCH(Rebate_Lookup[[#This Row],[SKU CODE]],'2025 ORNAMENTALS - UNITS'!A:A,0))","v":0},{"$f":"IF(Rebate_Lookup[[#This Row],[Instances]]=1,1,\nIF(AND(Rebate_Lookup[[#This Row],[Instances]]=2,Rebate_Lookup[[#This Row],[Order Form Quantity]]<Rebate_Lookup[[#This Row],[MOQ_2]]),1,IF(AND(Rebate_Lookup[[#This Row],[Instances]]=2,Rebate_Lookup[[#This Row],[Order Form Quantity]]>=Rebate_Lookup[[#This Row],[MOQ_2]]),2,\nIF(AND(Rebate_Lookup[[#This Row],[Instances]]=3,Rebate_Lookup[[#This Row],[Order Form Quantity]]<Rebate_Lookup[[#This Row],[MOQ_2]]),1,IF(AND(Rebate_Lookup[[#This Row],[Instances]]=3,Rebate_Lookup[[#This Row],[MOQ_2]]<=Rebate_Lookup[[#This Row],[Order Form Quantity]],Rebate_Lookup[[#This Row],[Order Form Quantity]]<Rebate_Lookup[[#This Row],[MOQ_3]]),2,IF(AND(Rebate_Lookup[[#This Row],[Instances]]=3,Rebate_Lookup[[#This Row],[Order Form Quantity]]>=Rebate_Lookup[[#This Row],[MOQ_3]]),3))))))","v":1},{"$f":"COUNTIF('2025 ORNAMENTALS - UNITS'!A:A,Rebate_Lookup[[#This Row],[SKU CODE]])","v":1},{"$f":"IFERROR(Rebate_Lookup[[#This Row],[Order Form Quantity]]>=Rebate_Lookup[[#This Row],[MOQ_2]],0)","v":false},null,{"$f":"COUNTIF('2025 ORNAMENTALS - UNITS'!A:A,Rebate_Lookup[[#This Row],[SKU CODE]])","v":1}]
[null,"D00001274","TT","B-Nine","5 lb",2,1,4,null,0,{"v":12,"d":"$12.00"},null,{"$f":"INDEX('2025 ORNAMENTALS - UNITS'!I:I,MATCH(Rebate_Lookup[[#This Row],[SKU CODE]],'2025 ORNAMENTALS - UNITS'!A:A,0))","v":0},{"$f":"IF(Rebate_Lookup[[#This Row],[Instances]]=1,1,\nIF(AND(Rebate_Lookup[[#This Row],[Instances]]=2,Rebate_Lookup[[#This Row],[Order Form Quantity]]<Rebate_Lookup[[#This Row],[MOQ_2]]),1,IF(AND(Rebate_Lookup[[#This Row],[Instances]]=2,Rebate_Lookup[[#This Row],[Order Form Quantity]]>=Rebate_Lookup[[#This Row],[MOQ_2]]),2,\nIF(AND(Rebate_Lookup[[#This Row],[Instances]]=3,Rebate_Lookup[[#This Row],[Order Form Quantity]]<Rebate_Lookup[[#This Row],[MOQ_2]]),1,IF(AND(Rebate_Lookup[[#This Row],[Instances]]=3,Rebate_Lookup[[#This Row],[MOQ_2]]<=Rebate_Lookup[[#This Row],[Order Form Quantity]],Rebate_Lookup[[#This Row],[Order Form Quantity]]<Rebate_Lookup[[#This Row],[MOQ_3]]),2,IF(AND(Rebate_Lookup[[#This Row],[Instances]]=3,Rebate_Lookup[[#This Row],[Order Form Quantity]]>=Rebate_Lookup[[#This Row],[MOQ_3]]),3))))))","v":1},{"$f":"COUNTIF('2025 ORNAMENTALS - UNITS'!A:A,Rebate_Lookup[[#This Row],[SKU CODE]])","v":1},{"$f":"IFERROR(Rebate_Lookup[[#This Row],[Order Form Quantity]]>=Rebate_Lookup[[#This Row],[MOQ_2]],0)","v":false},null,{"$f":"COUNTIF('2025 ORNAMENTALS - UNITS'!A:A,Rebate_Lookup[[#This Row],[SKU CODE]])","v":1}]
{"$rows_left_out":37}
{"sheet":"2025 NOW_EOP_LL","index":3,"n_rows":24,"n_cols":33,"rows_kept":24,"hidden":true}
["Manufacturer","Agency/TT","Segment","Region","Indication","Vol Buys","Program","Old Bayer SKU ","Old Envu SKU","SKU","Product","Size","2025 In-Season Price","NOW Price","In SZN-NOW delta","Min Qty","Rebate $","Final Price","CA In-season Price","CA NOW Price","CA Final Price","WA In-season Price","WA NOW Price","WA Final Price","Package Ounces","Standard Use Rate (oz/M)","Standard Use Rate (oz/Acre)","Price/1000 sq ft","Price/Acre","Total %","*cumlative","Set","Lookup"]
["Envu","A","GLO","NST","I",null,"EOP/ORN","84989509",null,"D00000903","Altus®","64 oz",437.2,437.2,0,"1-15",null,437.2,449.33,449.33,449.33,440.26,440.26,440.26,64,0.32,13.939200000000001,2.186,95.22216,0.1,null,1,{"$f":"PRICING[[#This Row],[SKU]]&\"-\"&PRICING[[#This Row],[Set]]","v":"D00000903-1"}]
["Envu","A","GLO","NST","I",null,"EOP/ORN","84989509",null,"D00000903","Altus®","64 oz",437.2,415.36,21.839999999999975,"16-31",null,415.36,449.33,426.89,426.89,440.26,418.27,418.27,64,0.32,13.939200000000001,2.0768,90.46540800000001,0.14995425434583712,null,{"$f":"IF(PRICING[[#This Row],[SKU]]=J2,AF2+1,1)","v":2},{"$f":"PRICING[[#This Row],[SKU]]&\"-\"&PRICING[[#This Row],[Set]]","v":"D00000903-2"}]
["Envu","A","GLO","NST","I",null,"EOP/ORN","84989509",null,"D00000903","Altus®","64 oz",437.2,393.6,43.599999999999966,"32+",null,393.6,449.33,404.52,404.52,440.26,396.36,396.36,64,0.32,13.939200000000001,1.9680000000000002,85.72608000000001,0.19972552607502284,null,{"$f":"IF(PRICING[[#This Row],[SKU]]=J3,AF3+1,1)","v":3},{"$f":"PRICING[[#This Row],[SKU]]&\"-\"&PRICING[[#This Row],[Set]]","v":"D00000903-3"}]
["FMC","TT","O",null,"I",null,"ORN",null,null,11008513,"Aria® Insecticide  ","160 g",193.38,193.38,0,"8+",{"v":21,"d":"$21.00"},172.38,{"$nulls":6},5.64383,0.09871441689623507,4.3,3.015043186023144,131.33528118316815,0.1085944771951598,null,{"$f":"IF(PRICING[[#This Row],[SKU]]=J4,AF4+1,1)","v":1},{"$f":"PRICING[[#This Row],[SKU]]&\"-\"&PRICING[[#This Row],[Set]]","v":"11008513-1"}]
["Envu","TT","O",null,"PGR",null,"ORN",null,null,"D00001274","B-Nine","5 lb",260.09999999999997,260.09999999999997,0,"4+",{"v":12,"d":"$12.00"},248.09999999999997,{"$nulls":6},80,2.7089072543617996,118,8.40099862258953,365.94749999999993,0.046136101499423265,null,{"$f":"IF(PRICING[[#This Row],[SKU]]=J5,AF5+1,1)","v":1},{"$f":"PRICING[[#This Row],[SKU]]&\"-\"&PRICING[[#This Row],[Set]]","v":"D00001274-1"}]
["Envu","A","O",null,"F",null,"ORN","86762153",null,"D00000908","Broadform","12 oz",250,250,0,"1-15",null,250,256.94,256.94,256.94,251.75,251.75,251.75,12,0.18365472910927455,8,3.826140189776553,166.66666666666666,0.1,null,{"$f":"IF(PRICING[[#This Row],[SKU]]=J6,AF6+1,1)","v":1},{"$f":"PRICING[[#This Row],[SKU]]&\"-\"&PRICING[[#This Row],[Set]]","v":"D00000908-1"}]
["Envu","A","O",null,"F",null,"ORN","86762153",null,"D00000908","Broadform","12 oz",250,237.48,12.52000000000001,"16-31",null,237.48,256.94,244.07,244.07,251.75,239.14,239.14,12,0.18365472910927455,8,3.6345270890725434,158.32,0.15008000000000002,null,{"$f":"IF(PRICING[[#This Row],[SKU]]=J7,AF7+1,1)","v":2},{"$f":"PRICING[[#This Row],[SKU]]&\"-\"&PRICING[[#This Row],[Set]]","v":"D00000908-2"}]
["Envu","A","O",null,"F",null,"ORN","86762153",null,"D00000908","Broadform","12 oz",250,225,25,"32+",null,225,256.94,231.24,231.24,251.75,226.58,226.58,12,0.18365472910927455,8,3.443526170798898,150,0.19999999999999998,null,{"$f":"IF(PRICING[[#This Row],[SKU]]=J8,AF8+1,1)","v":3},{"$f":"PRICING[[#This Row],[SKU]]&\"-\"&PRICING[[#This Row],[Set]]","v":"D00000908-3"}]
["Envu","TT","O",null,"I",null,"ORN",null,null,"D00001275","Floramite","1 qt",329.75,329.75,0,"4+",{"v":50,"d":"$50.00"},279.75,{"$nulls":6},32,0.18365472910927455,8,1.605544077134986,69.9375,0.15163002274450343,null,{"$f":"IF(PRICING[[#This Row],[SKU]]=J9,AF9+1,1)","v":1},{"$f":"PRICING[[#This Row],[SKU]]&\"-\"&PRICING[[#This Row],[Set]]","v":"D00001275-1"}]
{"$rows_left_out":14}